{"text_format":"1","workbook":"xlsx","n_sheets":15,"sheets":["Options and Impact","Facility Summary","Facility Profile","Rate Calculation","Medians","9.30.19 Costs Annualized","9.30.19 Costs Original","Wage Add-On 6-30-2021 and 2022","Medicaid CR Crosswalk","Inflation","Medicaid CMI","Normalizing CMI","Source and Assumptions","Providers","Data Validation"],"not_rendered":{"charts":0,"images":7,"macros":1,"external_links":0,"defined_names":141,"comments":0,"pivot_tables":0},"unopened":[],"bounds":{"document_bytes":16777216,"sheet_cells":100000,"rows_first":2000,"rows_last":500,"rows_between":2000,"halvings":0,"cell_chars":16384,"cell_head_chars":4096},"cells_cut":0,"cells_raw":0,"read":"whole","date_system":"1900"}

{"sheet":"Options and Impact","index":0,"n_rows":55,"n_cols":15,"rows_kept":55,"cut":false,"hidden":false,"merged":[[53,0,53,1],[52,0,52,1],[14,0,14,1],[42,0,42,1],[45,4,45,5],[50,4,50,5],[15,0,15,1],[20,0,20,1],[26,0,26,1],[17,0,17,1],[18,0,18,1],[38,0,38,1],[40,0,40,1],[49,0,49,1],[50,0,50,1],[36,0,36,1],[16,0,16,1],[27,0,27,1],[13,4,13,5],[0,7,0,9],[8,0,8,2],[8,4,8,5],[6,0,6,9],[20,4,20,5],[11,0,11,1],[12,0,12,1],[32,4,32,5],[21,0,21,1],[22,0,22,1],[23,0,23,1],[24,0,24,1],[32,0,32,1],[28,0,28,1],[30,0,30,1]]}
[null,null,null,null,null,null,null,"This model is Confidential and Deliberative, and is in draft form for modeling analysis.  This model is iterative and will be updated as decisions or DSS requests are made.  A final version will be completed subject to QA and final decision making prior to rate issuance."]
["Connecticut Department of Social Services"]
["Nursing Home Case Mix Reimbursement Options and Impact"]
[]
["Version 3.1 (4/14/2022)"]
[]
{"$rows_left_out":50}
{"sheet":"Facility Summary","index":1,"n_rows":9,"n_cols":70,"rows_kept":9,"cut":false,"hidden":false,"merged":[[5,65,5,69],[5,62,5,63],[5,0,5,9],[5,27,5,35],[5,48,5,52],[5,54,5,56],[5,58,5,60],[5,41,5,46],[5,11,5,25]]}
[]
[null,"Connecticut Department of Social Services"]
[null,"Facility Summary"]
[null,"Note: Please do not sort this tab."]
[null,null,null,null,null,null,1,2,3,4,null,5,6,8,9,null,null,11,12,13,14,null,15,16,17,null,null,18,19,20,23,24,21,22,null,null,25,26]
["General Provider Information",null,null,null,null,null,null,null,null,null,null,"Rate & Model Information",null,null,null,null,null,null,null,null,null,null,null,null,null,null,null,"Estimated Payments",null,null,null,null,null,null,null,null,null,"Estimated Fiscal Impact",null,"Rate Prior to Phase-In",null,null,null,null,null,null,null,null,null,null,null,null,null,null,null,null,null,null,"Corridor NF Per Diem Rate BAF Calculation",null,null,null,"Phased In Rate",null,null,"Phased In Rate Plus 7/1/2022 Add-Ons"]
{"$rows_left_out":4}
{"sheet":"Facility Profile","index":2,"n_rows":71,"n_cols":7,"rows_kept":71,"cut":false,"hidden":false,"merged":[[0,0,0,6],[1,0,1,6],[2,0,2,6],[4,0,4,6],[5,2,5,3],[76,4,76,6],[6,2,6,3],[23,0,23,6],[42,0,42,6],[19,0,19,6],[47,0,47,6],[74,0,75,0],[11,0,11,6],[52,0,52,6],[57,0,57,6]]}
["DRAFT July 1, 2022 REIMBURSEMENT RATE"]
["(FOR DEMONSTRATION PURPOSES ONLY)"]
[{"$f":"INDEX('Facility Summary'!$B:$B,MATCH('Facility Profile'!$B$14,'Facility Summary'!$G:$G,0))","v":0}]
[]
["SELECTED MODEL OPTIONS"]
["Cost Category","Selection","Peer Groups",null,"% of Median","Incentive %","Min. Occ."]
{"$rows_left_out":66}
{"sheet":"Rate Calculation","index":3,"n_rows":9,"n_cols":54,"rows_kept":9,"cut":false,"hidden":false,"merged":[[5,46,5,47],[5,0,5,10],[5,12,5,20],[5,22,5,28],[5,30,5,36],[5,38,5,40],[5,42,5,44]]}
[]
["Connecticut Department of Social Services"]
["Rate Calculation Summary"]
["Note: Please do not sort this tab."]
[null,null,null,null,1,2,3,4,5,6,7,8,9,10,11,12,13,14,null,15,16,null,18,19,20,21,22,23,24,25,26,27,28,29,30,31,32,33,34,35,36,37,38,39,40,41,42,43,44,45,null,null,46,47]
["General Provider Information",null,null,null,null,null,null,null,null,null,null,null,"Box 1 Direct Care Information",null,null,null,null,null,null,null,null,null,"Box 2 Indirect Care Information",null,null,null,null,null,null,null,"Box 3 A&G Information",null,null,null,null,null,null,null,"Box 4 Capital Information",null,null,null,"Provider Tax",null,null,null,"FRV & ROE",null,null,"Wage Increase",null,"Social Woker",null,"Rate Prior to Phase-In"]
{"$rows_left_out":4}
{"sheet":"Medians","index":4,"n_rows":8,"n_cols":8,"rows_kept":8,"cut":false,"hidden":false,"merged":[]}
[null,"Non-Fairfield"]
["Connecticut Department of Social Services",null,null,"Medians","Box 1 - Direct Care","Box 2 - Indirect Care","Box 3 - \nA&G","Box 4 - Capital"]
["Median Calculation","Hartford County",null,"1 - All Facilities",130.16,58.8,36.82,6.99]
[null,"New London County","Fairfield County","2 - CCNH Fairfield County",141.32999999999998]
[null,"Middlesex County",null,"2 - CCNH Non-Fairfield",127.08]
[null,"Windham County",null,"3 - RHNS Fairfield County","N/A"]
{"$rows_left_out":3}
{"sheet":"9.30.19 Costs Annualized","index":5,"n_rows":9,"n_cols":80,"rows_kept":9,"cut":false,"hidden":false,"merged":[[5,51,5,54],[5,63,5,79],[5,0,5,20],[5,21,5,32],[5,34,5,35],[5,38,5,43]]}
[null,null,null,null,null,1,2,3,4,5,6,7,8,9,10,11,12,13,14,15,16,17,18,19,20,21,22,23,24,25,26,27,28,29,30,31,32,33,34,35,36,37,38,39,40,41,42,43,44,45,46,47,48,49,50,51,52,53,54,55,56,57,58,59,60,61,62,63,64,65,66,67,68,69,70,71,72,73]
[]
["Connecticut Department of Social Services"]
["9/30/19 Annualized Cost Information",null,null,null,null,null,null,null,null,null,null,null,null,null,null,null,null,null,null,null,null,null,null,null,null,null,null,null,null,null,null,null,null,null,null,null,null,null,"Options/Impact Response:",null,{"$f":"'Options and Impact'!C12","v":0},null,null,{"$f":"'Options and Impact'!C13","v":0},null,null,null,null,null,null,null,{"$f":"'Options and Impact'!C22","v":0},{"$f":"'Options and Impact'!C23","v":0},{"$f":"'Options and Impact'!C24","v":0},{"$f":"'Options and Impact'!C25","v":0},null,null,null,null,null,null,null,null,null,{"$f":"'Options and Impact'!C16","v":0},null,null,null,null,null,null,{"$f":"'Options and Impact'!C19","v":0},null,null,{"$f":"'Options and Impact'!C17","v":0},{"$f":"'Options and Impact'!C18","v":0},{"$f":"IF('Options and Impact'!C28='Data Validation'!A26,3,IF('Options and Impact'!C28='Data Validation'!A27,4,'Options and Impact'!C28))","v":0},{"$f":"IF('Options and Impact'!C29='Data Validation'!A26,3,IF('Options and Impact'!C29='Data Validation'!A27,4,'Options and Impact'!C29))","v":0}]
["Note: Please do not sort this tab."]
["General Provider Information",null,null,null,null,null,null,null,null,null,null,null,null,null,null,null,null,null,null,null,null,"Cost Information",null,null,null,null,null,null,null,null,null,null,null,null,"Rates",null,null,null,"Management Fees",null,null,null,null,null,null,null,null,null,null,null,null,"Insurance",null,null,null,null,null,null,null,null,null,null,null,"Common Cost Report Adjustments"]
{"$rows_left_out":4}
{"sheet":"9.30.19 Costs Original","index":6,"n_rows":9,"n_cols":96,"rows_kept":9,"cut":false,"hidden":false,"merged":[[5,0,5,20],[5,38,5,43],[5,51,5,54],[5,63,5,79],[5,34,5,35],[5,21,5,32]]}
[null,null,null,null,null,1,2,3,4,5,6,7,8,9,10,11,12,13,14,15,16,17,18,19,20,21,22,23,24,25,26,27,28,29,30,31,32,33,34,35,36,37,38,39,40,41,42,43,44,45,46,47,48,49,50,51,52,53,54,55,56,57,58,59,60,61,62,63,64,65,66,67,68,69,70,71,72,73]
[]
["Connecticut Department of Social Services",null,null,null,null,null,null,null,null,6,7,8,9,10,11,12,13,14,15,16,null,18,19,20,21,22,23,null,null,null,null,null,null,null,24,25,null,null,27,30,null,32,35,null,37,null,null,null,null,null,null,40,43,46,50,null,null,null,null,null,null,null,null,51,54,null,null,null,null,null,null,58,null,59,60,61,62,63,64,66,null,74,76,null,null,null,null,77,78,null,79]
["9/30/19 Cost Information",null,null,null,null,null,null,null,null,null,null,null,null,null,null,null,null,null,null,null,null,null,null,null,null,null,null,null,null,null,null,null,null,null,null,null,null,null,"Options/Impact Response:",null,{"$f":"'Options and Impact'!C12","v":0},null,null,{"$f":"'Options and Impact'!C13","v":0},null,null,null,null,null,null,null,{"$f":"'Options and Impact'!C22","v":0},{"$f":"'Options and Impact'!C23","v":0},{"$f":"'Options and Impact'!C24","v":0},{"$f":"'Options and Impact'!C25","v":0},null,null,null,null,null,null,null,null,null,{"$f":"'Options and Impact'!C16","v":0},null,null,null,null,null,null,{"$f":"'Options and Impact'!C19","v":0},null,null,{"$f":"'Options and Impact'!C17","v":0},{"$f":"'Options and Impact'!C18","v":0},{"$f":"IF('Options and Impact'!C28='Data Validation'!A26,3,IF('Options and Impact'!C28='Data Validation'!A27,4,'Options and Impact'!C28))","v":0},{"$f":"IF('Options and Impact'!C29='Data Validation'!A26,3,IF('Options and Impact'!C29='Data Validation'!A27,4,'Options and Impact'!C29))","v":0}]
["Note: Please do not sort this tab.",null,null,null,null,1,2,3,4,5,6,7,8,9,10,11,12,13,14,15,16,17,18,19,20,21,22,23,24,25,26,27,28,29,30,31,32,33,34,35,36,37,38,39,40,41,42,43,44,45,46,47,48,49,50,51,52,53,54,55,56,57,58,59,60,61,62,63,64,65,66,67,68,69,70,71,72,73,74,75]
["General Provider Information",null,null,null,null,null,null,null,null,null,null,null,null,null,null,null,null,null,null,null,null,"Cost Information",null,null,null,null,null,null,null,null,null,null,null,null,"Rates",null,null,null,"Management Fees",null,null,null,null,null,null,null,null,null,null,null,null,"Insurance",null,null,null,null,null,null,null,null,null,null,null,"Common Cost Report Adjustments"]
{"$rows_left_out":4}
{"sheet":"Wage Add-On 6-30-2021 and 2022","index":7,"n_rows":7,"n_cols":17,"rows_kept":7,"cut":false,"hidden":false,"merged":[]}
["Schedule of Nursing Facility Rate Increases"]
["Data as of March 15, 2022"]
[]
[]
["Provider Name","Provider Number","Provider Number","Provider Type","7/1/2019 Wage Increase",null," 7/1/2019 Wage Increase Prorated","7/1/2020 Rate","10/1/2020 Wage Increase 1%","10/1/2020 Rate","1/1/2021 Wage Increase 1%","1/1/2021 Rate Excluding CRF","7/1/2021 Wage Increase 4.5%","Total Wage Add-on at 7/1/2021","CY 2020 Fair Rent Add-On",null,"Social Worker Add-On Effective 1/1/2022"]
["Example Provider # 1",1,1,"CCNH",4.9000000000000004,null,{"$f":"ROUND(E6*9/12,2)","v":3.68},250.12,{"$f":"ROUND(H6*0.01,2)","v":2.5},{"$f":"H6+I6","v":252.62},{"$f":"ROUND(J6*0.01,2)","v":2.5299999999999998},{"$f":"J6+K6","v":255.15},{"$f":"ROUND(L6*0.045,2)","v":11.48},{"$f":"G6+I6+K6+M6","v":20.189999999999998},0]
{"$rows_left_out":2}
{"sheet":"Medicaid CR Crosswalk","index":8,"n_rows":57,"n_cols":12,"rows_kept":57,"cut":false,"hidden":false,"merged":[[64,1,64,11],[0,1,0,11],[5,2,5,3],[5,4,5,5],[5,6,5,7],[5,8,5,9],[5,10,5,11],[5,0,5,1]]}
[null,"\n"]
["Connecticut Department of Social Services"]
["Medicaid Cost Report Crosswalk"]
[]
[]
["Direct Care Expenses",null,"Indirect Expenses",null,"Administrative and General Expenses",null,"Capital Expenses",null,"Fringes*",null,"Non-Reimbursable"]
{"$rows_left_out":52}
{"sheet":"Inflation","index":9,"n_rows":26,"n_cols":7,"rows_kept":26,"cut":false,"hidden":false,"merged":[[14,1,14,6],[0,0,0,1],[5,1,5,6],[13,1,13,6],[6,1,6,6],[23,1,23,5],[24,1,24,5],[25,1,25,5],[20,1,20,6],[21,1,21,6]]}
[]
["Connecticut Department of Social Services"]
["Inflation"]
[]
["Inflation Information:"]
[null,"2020 Fourth Quarter Healthcare Cost Review"]
{"$rows_left_out":21}
{"sheet":"Medicaid CMI","index":10,"n_rows":9,"n_cols":58,"rows_kept":9,"cut":false,"hidden":false,"merged":[[5,3,5,6],[5,8,5,11],[5,48,5,51],[5,13,5,16],[5,18,5,21],[5,23,5,26],[5,28,5,31],[5,33,5,36],[5,38,5,41],[5,43,5,46]]}
[]
["Connecticut Department of Social Services"]
["Medicaid CMI Calculations"]
[]
[1,2,3,4,5,6,7]
[null,null,null,"Preliminary Q1 2020",null,null,null,null,"Final Q1 2020",null,null,null,null,"Final Q2 2020",null,null,null,null,"Final Q3 2020",null,null,null,null,"Final Q4 2020",null,null,null,null,"Final Q1 2021",null,null,null,null,"Prelim Q2 2021",null,null,null,null,"Final Q3 2021",null,null,null,null,"Final Q4 2021"]
{"$rows_left_out":4}
{"sheet":"Normalizing CMI","index":11,"n_rows":10,"n_cols":12,"rows_kept":10,"cut":false,"hidden":false,"merged":[[0,8,0,10],[0,0,0,2],[5,0,7,0],[5,1,7,1],[5,2,7,2],[5,7,5,9],[5,4,5,6]]}
[]
["Connecticut Department of Social Services"]
["Normalizing CMI Calculations"]
[]
[1,2,3,null,20,21,22]
["Medicaid Number","CMS Facility Internal ID","Provider Name",null,"Annual CMIs with BC1 days included for the Period of 10/01/2018 - 9/30/2019",null,null,"Annual CMIs with BC1 days excluded for the Period of 10/01/2018 - 9/30/2019"]
{"$rows_left_out":5}
{"sheet":"Source and Assumptions","index":12,"n_rows":70,"n_cols":8,"rows_kept":70,"cut":false,"hidden":false,"merged":[[0,7,0,13],[17,0,17,12],[19,0,19,12],[4,0,4,12],[68,0,68,12],[22,0,22,12],[27,0,27,12],[33,0,33,12],[39,0,39,12],[59,0,59,12],[24,0,24,12],[54,0,54,12],[55,0,55,12],[45,0,45,12],[64,0,64,12]]}
[null,null,null,null,null,null,null,"This model is Confidential and Deliberative, and is in draft form for modeling analysis.  This model is iterative and will be updated as decisions or DSS requests are made.  A final version will be completed subject to QA and final decision making prior to rate issuance."]
["Connecticut Department of Social Services"]
["Source Data and Assumptions of the Rate Model"]
[]
["Options and Impact Tab"]
["The following cost assignments on the options and impact tab represent the current reimbursement system:"]
{"$rows_left_out":65}
{"sheet":"Providers","index":13,"n_rows":9,"n_cols":13,"rows_kept":9,"cut":false,"hidden":false,"merged":[[5,0,5,5]]}
[]
["Connecticut Department of Social Services"]
["Provider Selection Analysis"]
["Note: Please do not sort this tab."]
[null,null,null,null,null,null,null,null,"Count:",{"$f":"SUM(--(LEN(TRIM(J8:J9))>0))","v":2},null,"Count:",{"$f":"SUM(--(LEN(TRIM(M8:M9))>0))","v":0}]
["Options Indicators",null,null,null,null,null,null,"Hard coded indicators",null,"Hard coded provider numbers",null,null,"Do Not Edit This Column.  Dynamic array based on Options selected."]
{"$rows_left_out":4}
{"sheet":"Data Validation","index":14,"n_rows":61,"n_cols":2,"rows_kept":61,"cut":false,"hidden":false,"merged":[]}
[]
[]
["Data Validation"]
["Internal Use- Do Not Use"]
[]
["Peer Groups"]
{"$rows_left_out":55}